{"text_format":"1","workbook":"xlsx","n_sheets":8,"sheets":["共同利用申請書","別表１、３","共同利用承認書","使用簿（管理責任者用）","管理表転記用","◆設備番号プルダウン用リスト◆","Sheet1","★R6以降追加・変更したもの(R7.7.1追記）"],"not_rendered":{"charts":0,"images":0,"macros":1,"external_links":0,"defined_names":5,"comments":2,"pivot_tables":0},"unopened":[],"bounds":{"document_bytes":16777216,"sheet_cells":100000,"rows_first":2000,"rows_last":500,"rows_between":2000,"halvings":0,"cell_chars":16384,"cell_head_chars":4096},"cells_cut":0,"cells_raw":0,"read":"whole","date_system":"1900"}

{"sheet":"共同利用申請書","index":0,"n_rows":33,"n_cols":17,"rows_kept":33,"cut":false,"hidden":false,"merged":[[20,12,20,13],[20,15,20,16],[24,1,24,4],[25,9,25,10],[25,12,25,13],[22,2,22,3],[22,5,22,10],[20,9,20,10],[19,1,19,4],[25,2,25,3],[25,5,25,6],[25,7,25,8],[20,2,20,3],[20,5,20,7],[21,1,21,5],[21,7,21,10],[29,1,29,5],[29,6,29,8],[29,9,29,12],[29,13,29,16],[19,5,19,6],[19,7,19,10],[19,11,19,12],[19,13,19,16],[27,1,27,5],[27,6,27,8],[27,9,27,12],[27,13,27,16],[28,1,28,5],[28,6,28,8],[28,9,28,12],[28,13,28,16],[26,1,26,5],[26,6,26,8],[26,9,26,12],[26,13,26,16],[23,1,23,2],[23,12,23,13],[23,15,23,16],[25,15,25,16],[17,1,17,2],[17,3,17,8],[17,9,17,10],[17,11,17,16],[18,9,18,10],[18,2,18,3],[18,5,18,7],[16,1,16,3],[16,4,16,16],[18,12,18,16],[12,1,12,2],[12,3,12,8],[12,9,12,10],[12,11,12,16],[13,1,13,2],[13,3,13,4],[13,5,13,6],[13,7,13,16],[14,1,14,4],[14,5,14,6],[14,8,14,11],[14,12,14,13],[15,1,15,16],[10,1,10,7],[10,8,10,9],[10,10,10,16],[11,1,11,7],[11,8,11,9],[11,10,11,16],[1,0,1,16],[7,0,7,16],[8,1,8,2],[8,3,8,16],[9,1,9,2],[9,3,9,16]]}
["様式１（第４条関係）"]
["共同利用申請書"]
[]
[null,null,null,null,null,null,null,null,null,null,null,null,null,null,null,null,"　年　月　日"]
[]
["京都大学北部キャンパス機器分析拠点　拠点長　殿"]
[]
["京都大学北部キャンパス機器分析拠点が供する設備等の共同利用について、下記のとおり申請しますので、承認願います。なお、利用に際しては、京都大学北部キャンパス機器分析拠点共同利用規程を遵守します。"]
["所属機関","名 称"]
["又は組織等","住 所"]
["利用申請者",null,null,null,null,null,null,null,"職名"]
["電話番号",null,null,null,null,null,null,null,"ﾒｰﾙｱﾄﾞﾚｽ"]
["緊急連絡先","職 場",null,null,null,null,null,null,null,"自宅"]
["利用設備名","設備等番号",null,null,null,"設備等名称",null,{"$f":"VLOOKUP(D14,◆設備番号プルダウン用リスト◆!A2:B49,2,0)","v":{"$error":"#N/A"}}]
["利用期間",null,null,null,null,null,null,"～",null,null,null,null,null,null,"計",null,"時間"]
["利用目的"]
["利用料請求先","住所・機関(部署)名・職名・氏名"]
["＊利用申請者と異なる場合のみ記載","電話番号",null,null,null,null,null,null,null,"ﾒｰﾙｱﾄﾞﾚｽ"]
["予算区分",null,"大学運営費",null,"（","ミッション実現加速化経費",null,null,null,"特殊要因経費",null,null,"その他【　　　　　　　　　　　　】"]
[null,"（北部内の利用者のみ記載）",null,null,null,"予算科目：",null,null,null,null,null,"予算部署："]
["＊学内者のみ記載",null,"寄附金",null,null,"科学研究費助成事業等",null,null,null,"受託研究等",null,null,"間接経費",null,null,"機関経理補助金"]
[null,"（外部資金の場合）ＰＪコード　",null,null,null,null,"【",null,null,null,null,"】"]
[null,null,"その他",null,"【",null,null,null,null,null,null,null,"】"]
["事前講習","受講希望日時",null,null,"年",null,"月",null,"日",null,"時","～"]
["＊初回時のみ記載  ","受講済の場合は受講年月日",null,null,null,null,"年",null,"月",null,"日"]
["技術補助等",null,"操作等の補助",null,null,"技術相談",null,"（補助者：",null,null,null,"）","（所要時間：",null,null,"時間）"]
["利用申請者","所属部署",null,null,null,null,"職名",null,null,"氏名",null,null,null,"連絡先"]
["以外の利用者"]
[]
[]
["利用申請にあたっての注意事項"]
["１．本申請書は、北部キャンパス機器分析拠点運営推進室へ提出してください。"]
["２．申請内容に変更が生じた場合は、速やかに北部キャンパス機器分析拠点運営推進室へ連絡してください。"]

{"sheet":"別表１、３","index":1,"n_rows":91,"n_cols":12,"rows_kept":91,"cut":false,"hidden":false,"merged":[[71,4,72,9],[45,9,46,9],[82,0,82,1],[83,2,84,2],[2,0,3,0],[2,1,3,1],[2,2,3,2],[2,3,3,3],[2,4,3,4],[2,6,2,8],[2,9,3,9],[40,1,41,1],[17,9,18,9],[19,9,20,9],[40,9,41,9],[2,5,3,5],[29,9,30,9]]}
["別表１.設備等の利用料金"]
[]
["設備等\n番号","設備等名称","メーカー名","設備等\n保有部局","利用単位","関数用","単価",null,null,"備考"]
[null,null,null,null,null,null,"第３条第１号に掲げる者","第３条第２号に掲げる者","第３条第３号に掲げる者"]
[null,null,null,null,null,"関数用","学内","学術機関","民間機関",null,null,"1回当たり\n(事前講習)"]
["S-1","クリーンルーム",null,"理学研究科","京都大学大学院理学研究科低温物質科学研究支援室共同利用規程の定めに従う"]
["S-2","高磁場高周波核磁気共鳴装置 JEOL ECA600","日本電子㈱","理学研究科"]
["S-8","集束イオンビーム加工装置（FIB）Quanta 200 3DS","米国FEI社","理学研究科","1時間当たり\n(設備等利用)",{"$f":"A8&E8","v":"S-81時間当たり\n(設備等利用)"},2090,7580,17600]
["S-9","電界放出形透過電子顕微鏡（FE-TEM）JEM-2100F","日本電子㈱","理学研究科","1時間当たり\n(設備等利用)",{"$f":"A9&E9","v":"S-91時間当たり\n(設備等利用)"},810,8390,20300]
["S-10","高磁場高周波核磁気共鳴装置 JNM-ECZ600R","日本電子㈱","理学研究科","1時間当たり\n(設備等利用)","S-101時間当たり\n(設備等利用)",870,7470,20600]
["S-11","波長分散型電子線マイクロアナライザ","日本電子㈱","理学研究科","1日当たり\n(設備等利用)",{"$f":"A11&E11","v":"S-111日当たり\n(設備等利用)"},6960,10800,105600]
["S-12","超解像顕微鏡 N-SIM-S+N-STORM","㈱ニコン","理学研究科","1時間当たり\n(設備等利用)","S-121時間当たり\n(設備等利用)",1500,3380,13400]
["S-13","レーザラマン分光光度計自動イメージングシステム NRS-5100","日本分光㈱","理学研究科","1時間当たり\n(設備等利用)","S-131時間当たり\n(設備等利用)",1440,1860,8000]
[null,null,null,null,"1日当たり\n(設備等利用)",{"$f":"A13&E14","v":"S-131日当たり\n(設備等利用)"},11520,14880,64000]
["S-14","超高感度示差型カロリメータ VP-DSCシステム","米国GEヘルスケア社","理学研究科","1日当たり\n(設備等利用)",{"$f":"A15&E15","v":"S-141日当たり\n(設備等利用)"},120,35280,122400]
["S-15","レーザラマン分光光度計NRS-3100型","日本分光㈱","理学研究科","1時間当たり\n(設備等利用)","S-151時間当たり\n(設備等利用)",450,450,9900]
["S-16","超高精度ESI-TOF MSシステム microTOFⅡ-KSⅡ","独国ブルカー・ダルトニクス社","理学研究科","1時間当たり\n(設備等利用)",{"$f":"A17&E17","v":"S-161時間当たり\n(設備等利用)"},3870,10320,21100]
["S-17","粉末X線回折装置 SmartLab-SS","㈱リガク","理学研究科","1時間当たり\n(設備等利用)","S-171時間当たり\n(設備等利用)",510,null,null,"放射線管理要領に基づき、従事者として許可された場合のみ利用可能。"]
[null,null,null,null,"1回当たり\n(事前講習)",{"$f":"A18&E19","v":"S-171回当たり\n(事前講習)"},510]
["S-18","ラマン顕微鏡 XploRA-ST","㈱堀場製作所","理学研究科","1時間当たり\n(設備等利用)",{"$f":"A20&E20","v":"S-181時間当たり\n(設備等利用)"},910,1790,5900]
[null,null,null,null,"1回当たり\n(事前講習)",{"$f":"A20&E21","v":"S-181回当たり\n(事前講習)"},910,1790,5900]
["S-19","マルチタイプICP発光分光分析装置 ICPE-9000","㈱島津製作所","理学研究科","1時間当たり\n(設備等利用)",{"$f":"A22&E22","v":"S-191時間当たり\n(設備等利用)"},1990,2940,5200]
["S-20","全身用X線CT診断装置 Alexion TSX-032A","東芝メディカルシステムズ㈱","理学研究科","1回当たり\n(設備等利用)",{"$f":"A23&E23","v":"S-201回当たり\n(設備等利用)"},4240,21400,31600]
["S-21","SQUID磁束計1\n（磁化率測定装置MPMS 1テスラ）","米国カンタムデザイン社","理学研究科","1日当たり\n(設備等利用)",{"$f":"A24&E24","v":"S-211日当たり\n(設備等利用)"},7200,7680,16800]
["S-22","SQUID磁束計2\n（磁化率測定装置MPMS 5テスラ）","米国カンタムデザイン社","理学研究科","1日当たり\n(設備等利用)",{"$f":"A25&E25","v":"S-221日当たり\n(設備等利用)"},7200,7680,16800]
["S-23","SQUID磁束計3\n（磁化率測定装置MPMS 5.5テスラ）","米国カンタムデザイン社","理学研究科","1日当たり\n(設備等利用)","S-231日当たり\n(設備等利用)",7200,7680,16800]
["S-24","SQUID磁束計4\n（磁化率測定装置MPMS 7テスラ）","米国カンタムデザイン社","理学研究科","1日当たり\n(設備等利用)","S-241日当たり\n(設備等利用)",7200,7680,16800]
["S-25","アークプラズマガン成膜装置 APD-2P特","アルバック理工㈱","理学研究科","1時間当たり\n(設備等利用)",{"$f":"A28&E28","v":"S-251時間当たり\n(設備等利用)"},230,1230,6700]
["S-26","2波長同時画像取得プリズムTIRF電動倒立顕微鏡システム","㈱ニコン","理学研究科","1時間当たり\n(設備等利用)",{"$f":"A29&E29","v":"S-261時間当たり\n(設備等利用)"},1520,1520,8600]
["S-27","マイクロフォーカスX線CT","㈱VoxelWorks","理学研究科","1回当たり\n(設備等利用)",{"$f":"A30&E30","v":"S-271回当たり\n(設備等利用)"},5080,7020,32000,"放射線管理要領に基づき、従事者として許可された場合のみ利用可能。"]
[null,null,null,null,"1回当たり\n(事前講習)",{"$f":"A30&E31","v":"S-271回当たり\n(事前講習)"},10160,14040,63900]
["S-28","走査型プローブ顕微鏡 SPM-Nanoa","㈱島津製作所","理学研究科","1時間当たり\n(設備等利用)",{"$f":"A32&E32","v":"S-281時間当たり\n(設備等利用)"},4310,4310,11400]
["S-29","マトリックス支援レーザー脱離イオン化飛行時間質量分析装置 JMS-S3000 SpiralTOF™-plus","日本電子㈱","理学研究科","1時間当たり\n(設備等利用)",{"$f":"A33&E33","v":"S-291時間当たり\n(設備等利用)"},3880,4020,14600]
["S-30","単結晶X線構造解析装置 XtaLAB Synergy-R/Cu","㈱リガク","理学研究科","1時間当たり\n(設備等利用)",{"$f":"A34&E34","v":"S-301時間当たり\n(設備等利用)"},1080,null,null,"放射線管理要領に基づき、従事者として許可された場合のみ利用可能。"]
["A-1","高分解能X線CT装置","㈱島津製作所","農学研究科","1時間当たり\n(設備等利用)","A-11時間当たり\n(設備等利用)",1500,null,null,"放射線管理要領に基づき、従事者として許可された場合のみ利用可能。"]
["A-2","単結晶X線構造解析装置 R-AXIS RAPID Ⅱ","㈱リガク","農学研究科","1時間当たり\n(設備等利用)","A-21時間当たり\n(設備等利用)",1500,null,null,"放射線管理要領に基づき、従事者として許可された場合のみ利用可能。"]
["A-3","電界放出形走査電子顕微鏡","㈱日立ハイテクノロジーズ　","農学研究科","1時間当たり\n(設備等利用)","A-31時間当たり\n(設備等利用)",3000,10800,25200]
["A-4","超高感度MALDI-TOF MS","独国ブルカー・ダルトニクス社","農学研究科","1時間当たり\n(設備等利用)","A-41時間当たり\n(設備等利用)",4000,4700,16000]
["A-5","固体専用超伝導フーリエ変換核磁気共鳴装置","米国バリアンインコーポレーション社","農学研究科","1時間当たり\n(設備等利用)","A-51時間当たり\n(設備等利用)",6000,10600,23100]
["A-6","超伝導フーリエ変換核磁気共鳴装置","米国バリアンインコーポレーション社","農学研究科","1時間当たり\n(設備等利用)","A-61時間当たり\n(設備等利用)",1000,4500,12700]
["A-7","高速液体クロマトグラフ－イオンモビリティ－タンデム四重極リニアイオントラップ型質量分析計","米国エービー・サイエックス社","農学研究科","1時間当たり\n(設備等利用)",{"$f":"A41&E41","v":"A-71時間当たり\n(設備等利用)"},2670,5870,11700]
[null,null,null,null,"1回当たり\n(事前講習)",{"$f":"A41&E42","v":"A-71回当たり\n(事前講習)"},2670,5870,11700]
["A-8","トリプル四重極型ガスクロマトグラフ質量分析計","㈱島津製作所","農学研究科","1時間当たり\n(設備等利用)","A-81時間当たり\n(設備等利用)",850,1020,2200]
["A-9","シングル四重極誘導結合プラズマ質量分析計","米国サーモフィッシャーサイエンティフィック社","農学研究科","1時間当たり\n(設備等利用)","A-91時間当たり\n(設備等利用)",4830,5580,10500]
["A-10","X線テレビ検査システムS005","㈱島津製作所","農学研究科","1時間当たり\n(設備等利用)",{"$f":"A45&E45","v":"A-101時間当たり\n(設備等利用)"},5900,null,null,"放射線管理要領に基づき、従事者として許可された場合のみ利用可能。"]
["A-11","固体粘弾性測定装置 LOF・9932-001","仏国01dB-Metravib社","農学研究科","1時間当たり\n(設備等利用)",{"$f":"A46&E46","v":"A-111時間当たり\n(設備等利用)"},820,1460,4200,"機器利用に必要な液体窒素については、別途学内単価により利用者へ請求する。"]
[null,null,null,null,"1日当たり\n(設備等利用)",{"$f":"A46&E47","v":"A-111日当たり\n(設備等利用)"},6560,11680,33600]
["A-12","超伝導マグネット AVANCEⅢ400NルーチンNMR特別仕様","独国ブルカー・バイオスピン社","農学研究科","1時間当たり\n(設備等利用)","A-121時間当たり\n(設備等利用)",300,440,1500]
["A-13","走査型プローブ顕微鏡 SPM-9600","㈱島津製作所","農学研究科","1時間当たり\n(設備等利用)","A-131時間当たり\n(設備等利用)",520,810,2000]
["A-14","高速液体クロマトグラフ質量分析計 LCMS-2020","㈱島津製作所","農学研究科","1時間当たり\n(設備等利用)","A-141時間当たり\n(設備等利用)",700,2600,3600]
[null,null,null,null,"1回当たり\n(事前講習)",{"$f":"A50&E51","v":"A-141回当たり\n(事前講習)"},2100,7800,10800]
["A-15","電子線トモグラフィ装置","日本電子㈱","農学研究科","1時間当たり\n(設備等利用)",{"$f":"A52&E52","v":"A-151時間当たり\n(設備等利用)"},650,5890,10100]
[null,null,null,null,"1日当たり\n(設備等利用)",{"$f":"A52&E53","v":"A-151日当たり\n(設備等利用)"},5200,47120,80800]
[null,null,null,null,"1回当たり\n(事前講習)",{"$f":"A52&E54","v":"A-151回当たり\n(事前講習)"},1940,17670,30200]
["A-16","QuantStudio12KFlex リアルタイムPCRシステム","米国ライフテクノロジーズ社","農学研究科","1回当たり\n(設備等利用)",{"$f":"A55&E55","v":"A-161回当たり\n(設備等利用)"},2000,3120,16400]
["A-17","微量天然化合物高速液体クロマトグラフ質量分析装置システム LCMS-8030","㈱島津製作所","農学研究科","1時間当たり\n(設備等利用)",{"$f":"A56&E56","v":"A-171時間当たり\n(設備等利用)"},300,900,2200]
["A-18","高速液体クロマトグラフ質量分析計システム LCMS-8040","㈱島津製作所","農学研究科","1時間当たり\n(設備等利用)","A-181時間当たり\n(設備等利用)",490,610,1300]
["A-19","水晶振動子マイクロバランス応用・分子間相互作用解析システム","瑞国Biolin Scientific社","農学研究科","1時間当たり\n(設備等利用)",{"$f":"A58&E58","v":"A-191時間当たり\n(設備等利用)"},1990,3630,9100]
["A-20","共焦点レーザ走査型顕微鏡 FV1200","オリンパス㈱","農学研究科","1時間当たり\n(設備等利用)","A-201時間当たり\n(設備等利用)",3610,6330,11600]
["A-22","FT／IR－6600 フーリエ変換赤外分光光度計（type VFM）","日本分光㈱","農学研究科","1日当たり\n(設備等利用)","A-221日当たり\n(設備等利用)",7600,12800,26000]
{"$rows_left_out":32}
{"sheet":"共同利用承認書","index":2,"n_rows":33,"n_cols":9,"rows_kept":33,"cut":false,"hidden":true,"merged":[[18,1,18,2],[19,3,19,4],[19,5,19,6],[20,1,20,2],[20,5,20,6],[21,4,21,8],[32,4,34,8],[22,3,22,4],[27,1,27,8],[28,1,28,8],[29,1,29,8],[30,1,30,8],[14,1,14,8],[15,1,15,8],[16,1,16,8],[3,7,3,8],[2,7,2,8],[5,1,5,2],[10,1,10,8],[13,1,13,8]]}
[null,null,null,null,null,null,null,"承認番号：",{"$f":"'使用簿（管理責任者用）'!A5","v":0}]
[]
[null,null,null,null,null,null,null,"事務連絡"]
[null,null,null,null,null,null,null,"●●年●●月●●日"]
[]
[null,{"$f":"共同利用申請書!B11:H11","v":0},null,"殿"]
[]
[null,null,null,null,null,null,null,null,"京都大学北部キャンパス機器分析拠点　拠点長"]
[]
[]
[null,"共同利用承認書"]
[]
[]
[null,"　●●年●●月●●日に申請のありました下記共同利用について、承認します。"]
[null,"　設備等の利用に当たっては、該当設備等の利用方法について十分に確認し、認識したうえで利用してください。"]
[]
[null,"記"]
[]
[null,"利用日時：",null,{"$f":"共同利用申請書!B15","v":"00:00:00"},{"$f":"共同利用申請書!F15","v":"00:00:00"},"～",{"$f":"共同利用申請書!I15","v":"00:00:00"},{"$f":"共同利用申請書!M15","v":"00:00:00"}]
[]
[null,"利用設備：",null,"（設備等番号）",{"$f":"共同利用申請書!D14","v":0}]
[null,null,null,"（設備等名称）",{"$f":"共同利用申請書!H14","v":{"$error":"#N/A"}}]
[]
[]
[]
[]
[null,"※利用にあたっての留意点"]
[null,"　・利用料は実績時間に基づき機器利用後に請求いたします。"]
[null,"　・申請時間は変更の無いようご利用ください。"]
[null,"　・申請時間の変更が必要な場合は、設備等の担当者に申し出てください。\n　　なお、ご希望に添えない場合もありますのでご了承ください。"]
[null,"　・その他、ご不明な点がありましたら設備等の担当者もしくは拠点運営推進室までお問い合わせください。"]
[]
[null,null,null,null,"担　当：北部キャンパス機器分析拠点　拠点運営推進室\nT  E  L：075-753-6496\ne-mail：nocias-kyotenjimu@mail2.adm.kyoto-u.ac.jp"]

{"sheet":"使用簿（管理責任者用）","index":3,"n_rows":38,"n_cols":14,"rows_kept":38,"cut":false,"hidden":true,"merged":[[12,6,12,7],[11,6,11,8],[12,8,13,8],[11,0,13,0],[12,1,12,2],[12,4,13,4],[12,5,13,5],[11,1,11,5],[2,12,3,12],[2,13,3,13],[2,0,3,0],[2,2,3,2],[2,3,3,3],[2,4,3,4],[2,5,3,5],[2,6,3,6],[2,7,2,8],[2,9,3,9],[2,10,3,10],[2,11,3,11],[36,0,36,1],[32,0,32,1],[33,0,33,1],[34,0,34,1],[35,0,35,1]]}
[]
["■管理簿（研究室用）※入力不要",null,null,null,null,null,null,null,null,null,null,null,"（単位：円）"]
["承認番号","利用者区分","所属機関又は組織等","利用申請者","職名","設備等番号","設備等名称","利用期間【実績】",null,"設備利用料","技術料","事前講習料","消耗品費等","利用料計"]
[null,"（学内or学外）",null,null,null,null,null,"開始日","終了日"]
[null,null,{"$f":"共同利用申請書!D9","v":0},{"$f":"共同利用申請書!B11","v":0},{"$f":"共同利用申請書!K11","v":0},{"$f":"共同利用申請書!D14","v":0},{"$f":"共同利用申請書!H14","v":{"$error":"#N/A"}},{"$f":"MIN(A15:A24)","v":"00:00:00"},{"$f":"MAX(A15:A24)","v":"00:00:00"},{"$f":"F25","v":0},{"$f":"I25","v":0},null,{"$f":"E37","v":0},{"$f":"SUM(J5:M5)","v":0}]
[null,null,null,null,null,null,null,null,null,null,null,{"$f":"VLOOKUP($F$5&B5,Sheet1!J2:K19,2,0)","v":{"$error":"#N/A"}}]
[null,"学内",null,null,null,{"$f":"F5&'別表１、３'!L5","v":"01回当たり\n(事前講習)"}]
[null,"学術機関"]
[null,"民間機関"]
["■使用簿　※要入力",null,null,null,null,null,null,null,null,null,null,"※事前講習課金設定対象機器については、参考として上に単価表示される"]
["（１）設備利用及び技術補助"]
["利用日","設備利用",null,null,null,null,"技術補助等"]
[null,"利用時間【実績】",null,"利用時間","利用単位","設備利用料（円）","技術補助等【実績】",null,"技術料（円）"]
[null,"開始時間","終了時間","（合計）",null,null,"補助者区分","所要時間"]
[null,null,null,{"$f":"VALUE(CEILING(C15-B15,\"1:00\")*24)","v":0},null,{"$f":"VLOOKUP($F$5&E15,'別表１、３'!$F$5:$I$73,MATCH('使用簿（管理責任者用）'!$B$5,'別表１、３'!$F$5:$I$5,0),0)*IF(E15=$E$27,D15,1)","v":{"$error":"#N/A"}},null,null,{"$f":"ROUND(VLOOKUP(G15,'別表１、３'!$A$84:$D$85,4,0)*'使用簿（管理責任者用）'!H15,0)","v":{"$error":"#N/A"}}]
[null,null,null,{"$f":"VALUE(CEILING(C16-B16,\"1:00\")*24)","v":0},null,{"$f":"VLOOKUP($F$5&E16,'別表１、３'!$F$5:$I$73,MATCH('使用簿（管理責任者用）'!$B$5,'別表１、３'!$F$5:$I$5,0),0)*IF(E16=$E$27,D16,1)","v":{"$error":"#N/A"}},null,null,{"$f":"ROUND(VLOOKUP(G16,'別表１、３'!$A$84:$D$85,4,0)*'使用簿（管理責任者用）'!H16,0)","v":{"$error":"#N/A"}}]
[null,null,null,0,null,{"$f":"VLOOKUP($F$5&E17,'別表１、３'!$F$5:$I$73,MATCH('使用簿（管理責任者用）'!$B$5,'別表１、３'!$F$5:$I$5,0),0)*IF(E17=$E$27,D17,1)","v":{"$error":"#N/A"}},null,null,{"$f":"ROUND(VLOOKUP(G17,'別表１、３'!$A$84:$D$85,4,0)*'使用簿（管理責任者用）'!H17,0)","v":{"$error":"#N/A"}}]
[null,null,null,0,null,{"$f":"VLOOKUP($F$5&E18,'別表１、３'!$F$5:$I$73,MATCH('使用簿（管理責任者用）'!$B$5,'別表１、３'!$F$5:$I$5,0),0)*IF(E18=$E$27,D18,1)","v":{"$error":"#N/A"}},null,null,{"$f":"ROUND(VLOOKUP(G18,'別表１、３'!$A$84:$D$85,4,0)*'使用簿（管理責任者用）'!H18,0)","v":{"$error":"#N/A"}}]
[null,null,null,0,null,{"$f":"VLOOKUP($F$5&E19,'別表１、３'!$F$5:$I$73,MATCH('使用簿（管理責任者用）'!$B$5,'別表１、３'!$F$5:$I$5,0),0)*IF(E19=$E$27,D19,1)","v":{"$error":"#N/A"}},null,null,{"$f":"ROUND(VLOOKUP(G19,'別表１、３'!$A$84:$D$85,4,0)*'使用簿（管理責任者用）'!H19,0)","v":{"$error":"#N/A"}}]
[null,null,null,0,null,{"$f":"VLOOKUP($F$5&E20,'別表１、３'!$F$5:$I$73,MATCH('使用簿（管理責任者用）'!$B$5,'別表１、３'!$F$5:$I$5,0),0)*IF(E20=$E$27,D20,1)","v":{"$error":"#N/A"}},null,null,{"$f":"ROUND(VLOOKUP(G20,'別表１、３'!$A$84:$D$85,4,0)*'使用簿（管理責任者用）'!H20,0)","v":{"$error":"#N/A"}}]
[null,null,null,0,null,{"$f":"VLOOKUP($F$5&E21,'別表１、３'!$F$5:$I$73,MATCH('使用簿（管理責任者用）'!$B$5,'別表１、３'!$F$5:$I$5,0),0)*IF(E21=$E$27,D21,1)","v":{"$error":"#N/A"}},null,null,{"$f":"ROUND(VLOOKUP(G21,'別表１、３'!$A$84:$D$85,4,0)*'使用簿（管理責任者用）'!H21,0)","v":{"$error":"#N/A"}}]
[null,null,null,0,null,{"$f":"VLOOKUP($F$5&E22,'別表１、３'!$F$5:$I$73,MATCH('使用簿（管理責任者用）'!$B$5,'別表１、３'!$F$5:$I$5,0),0)*IF(E22=$E$27,D22,1)","v":{"$error":"#N/A"}},null,null,{"$f":"ROUND(VLOOKUP(G22,'別表１、３'!$A$84:$D$85,4,0)*'使用簿（管理責任者用）'!H22,0)","v":{"$error":"#N/A"}}]
[null,null,null,0,null,{"$f":"VLOOKUP($F$5&E23,'別表１、３'!$F$5:$I$73,MATCH('使用簿（管理責任者用）'!$B$5,'別表１、３'!$F$5:$I$5,0),0)*IF(E23=$E$27,D23,1)","v":{"$error":"#N/A"}},null,null,{"$f":"ROUND(VLOOKUP(G23,'別表１、３'!$A$84:$D$85,4,0)*'使用簿（管理責任者用）'!H23,0)","v":{"$error":"#N/A"}}]
[null,null,null,0,null,{"$f":"VLOOKUP($F$5&E24,'別表１、３'!$F$5:$I$73,MATCH('使用簿（管理責任者用）'!$B$5,'別表１、３'!$F$5:$I$5,0),0)*IF(E24=$E$27,D24,1)","v":{"$error":"#N/A"}},null,null,{"$f":"ROUND(VLOOKUP(G24,'別表１、３'!$A$84:$D$85,4,0)*'使用簿（管理責任者用）'!H24,0)","v":{"$error":"#N/A"}}]
[{"$f":"COUNTA(A15:A24)","v":0},null,null,{"$f":"SUM(D15:D24)","v":0},null,{"$f":"SUMIF(F15:F24,\"<>#N/A\")","v":0},null,{"$f":"SUM(H15:H24)","v":0},{"$f":"SUMIF(I15:I24,\"<>#N/A\")","v":0}]
["※行が足りない場合は、行全体をコピーのうえ挿入してください。"]
[null,null,null,null,"1時間当たり\n(設備等利用)"]
[null,null,null,null,"1日当たり\n(設備等利用)"]
[null,null,null,null,"1回当たり\n(設備等利用)"]
[]
["（２）消耗品費等"]
["　　【注意】料金規程の算定において消耗品の積算に含めず、別途請求することとなっている案件のみ記載"]
["内訳",null,"単価（税込み）","数量","計"]
[null,null,null,null,{"$f":"C34*D34","v":0}]
[null,null,null,null,{"$f":"C35*D35","v":0}]
[null,null,null,null,0]
[null,null,null,null,{"$f":"SUM(E34:E36)","v":0}]
["※行が足りない場合は、行全体をコピーのうえ挿入してください。"]

{"sheet":"管理表転記用","index":4,"n_rows":17,"n_cols":33,"rows_kept":17,"cut":false,"hidden":true,"merged":[[0,26,1,26],[0,21,0,25],[0,15,1,15],[0,18,1,18],[0,17,1,17],[0,19,1,19],[0,16,1,16],[0,20,1,20],[0,11,0,12],[0,0,1,0],[0,2,1,2],[0,3,1,3],[0,4,1,4],[0,5,1,5],[0,6,1,6],[0,7,0,10]]}
["承認番号","利用者区分","所属機関又は組織等","利用申請者","職名","設備等番号","設備等名称","利用期間/時間【申請時】",null,null,null,"利用期間【実績】",null,"利用日数","利用時間","設備利用料","技術料","事前講習料","消耗品費等","利用料計","管理部局","予算区分",null,null,null,null,"備考","➡以下、利用者及び請求先情報"]
[null,"（学内or学外）",null,null,null,null,null,"開始日","開始時間","終了日","終了時間","開始日","終了日","（合計）","（合計）",null,null,null,null,null,null,"経費名称","予算科目（運営費の場合）","予算部署（運営費の場合）","PJコード","請求処理方法",null,"所属機関住所","電話番号","メールアドレス","請求先住所等","請求先電話番号","請求先メールアドレス"]
[{"$f":"'使用簿（管理責任者用）'!A5","v":0},{"$f":"'使用簿（管理責任者用）'!B5","v":0},{"$f":"共同利用申請書!D9","v":0},{"$f":"共同利用申請書!B11","v":0},{"$f":"共同利用申請書!K11","v":0},{"$f":"共同利用申請書!D14","v":0},{"$f":"共同利用申請書!H14","v":{"$error":"#N/A"}},{"$f":"共同利用申請書!B15","v":"00:00:00"},{"$f":"共同利用申請書!F15","v":"00:00:00"},{"$f":"共同利用申請書!I15","v":"00:00:00"},{"$f":"共同利用申請書!M15","v":"00:00:00"},{"$f":"'使用簿（管理責任者用）'!H5","v":"00:00:00"},{"$f":"'使用簿（管理責任者用）'!I5","v":"00:00:00"},{"$f":"'使用簿（管理責任者用）'!A25","v":0},{"$f":"'使用簿（管理責任者用）'!D25","v":0},{"$f":"'使用簿（管理責任者用）'!J5","v":0},{"$f":"'使用簿（管理責任者用）'!K5","v":0},{"$f":"'使用簿（管理責任者用）'!L5","v":0},{"$f":"'使用簿（管理責任者用）'!M5","v":0},{"$f":"SUM(P3,Q3,R3,S3)","v":0},{"$f":"VLOOKUP(F3,'別表１、３'!$A$6:$D$72,4,0)","v":{"$error":"#N/A"}},null,{"$f":"共同利用申請書!H20","v":0},{"$f":"共同利用申請書!N20","v":0},{"$f":"共同利用申請書!H22","v":0},{"$f":"VLOOKUP(V3,$V$8:$Z$17,5,FALSE)","v":{"$error":"#N/A"}},null,{"$f":"共同利用申請書!D10","v":0},{"$f":"共同利用申請書!B12","v":0},{"$f":"共同利用申請書!K12","v":0},{"$f":"共同利用申請書!E17","v":0},{"$f":"共同利用申請書!D18","v":0},{"$f":"共同利用申請書!L18","v":0}]
[null,null,null,null,null,null,null,null,null,null,null,null,null,null,null,null,null,{"$f":"VLOOKUP(F3,Sheet1!$A$3:$B$63,2,FALSE)","v":{"$error":"#N/A"}}]
[]
[]
[]
[null,null,null,null,null,null,null,null,null,null,null,null,null,null,null,null,null,null,null,null,null,"大学運営費",null,null,null,"予算振替"]
[null,null,null,null,null,null,null,null,null,null,null,null,null,null,null,null,null,null,null,null,null,"大学運営費（ミッション実現加速化経費）",null,null,null,"費用付替"]
[null,null,null,null,null,null,null,null,null,null,null,null,null,null,null,null,null,null,null,null,null,"大学運営費（特殊要因経費）",null,null,null,"費用付替"]
[null,null,null,null,null,null,null,null,null,null,null,null,null,null,null,null,null,null,null,null,null,"大学運営費（その他）戦略・重点的経費など",null,null,null,"費用付替"]
[null,null,null,null,null,null,null,null,null,null,null,null,null,null,null,null,null,null,null,null,null,"寄附金",null,null,null,"費用付替"]
[null,null,null,null,null,null,null,null,null,null,null,null,null,null,null,null,null,null,null,null,null,"科学研究費助成事業等",null,null,null,"請求書発行"]
[null,null,null,null,null,null,null,null,null,null,null,null,null,null,null,null,null,null,null,null,null,"受託研究等",null,null,null,"費用付替"]
[null,null,null,null,null,null,null,null,null,null,null,null,null,null,null,null,null,null,null,null,null,"間接経費",null,null,null,"費用付替"]
[null,null,null,null,null,null,null,null,null,null,null,null,null,null,null,null,null,null,null,null,null,"機関経理補助金",null,null,null,"費用付替"]
[null,null,null,null,null,null,null,null,null,null,null,null,null,null,null,null,null,null,null,null,null,"その他",null,null,null,"要確認（備考欄へ記入）"]

{"sheet":"◆設備番号プルダウン用リスト◆","index":5,"n_rows":59,"n_cols":2,"rows_kept":59,"cut":false,"hidden":true,"merged":[]}
["設備等番号"]
["S-8","集束イオンビーム加工装置（FIB）Quanta 200 3DS"]
["S-9","電界放出形透過電子顕微鏡（FE-TEM）JEM-2100F"]
["S-10","高磁場高周波核磁気共鳴装置 JNM-ECZ600R"]
["S-11","波長分散型電子線マイクロアナライザ"]
["S-12","超解像顕微鏡 N-SIM-S+N-STORM"]
["S-13","レーザラマン分光光度計自動イメージングシステム NRS-5100"]
["S-14","超高感度示差型カロリメータ VP-DSCシステム"]
["S-15","レーザラマン分光光度計NRS-3100型"]
["S-16","超高精度ESI-TOF MSシステム microTOFⅡ-KSⅡ"]
["S-17","粉末X線回折装置 SmartLab-SS"]
["S-18","ラマン顕微鏡 XploRA-ST"]
["S-19","マルチタイプICP発光分光分析装置 ICPE-9000"]
["S-20","全身用X線CT診断装置 Alexion TSX-032A"]
["S-25","アークプラズマガン成膜装置 APD-2P特"]
["S-26","2波長同時画像取得プリズムTIRF電動倒立顕微鏡システム"]
["S-27","マイクロフォーカスX線CT"]
["S-28","⾛査型プローブ顕微鏡 SPM-Nanoa"]
["S-29","マトリックス⽀援レーザー脱離イオン化飛行時間質量分析装置 JMS-S3000 SpiralTOF™-plus"]
["S-30","単結晶X線構造解析装置 XtaLAB Synergy-R/Cu"]
["A-1","高分解能X線CT装置"]
["A-2","単結晶X線構造解析装置 R-AXIS RAPID Ⅱ"]
["A-3","電界放出形走査電子顕微鏡"]
["A-4","超高感度MALDI-TOF MS"]
["A-5","固体専用超伝導フーリエ変換核磁気共鳴装置"]
["A-6","超伝導フーリエ変換核磁気共鳴装置"]
["A-7","高速液体クロマトグラフ－イオンモビリティ－タンデム四重極リニアイオントラップ型質量分析計"]
["A-8","トリプル四重極型ガスクロマトグラフ質量分析計"]
["A-9","シングル四重極誘導結合プラズマ質量分析計"]
["A-10","X線テレビ検査システムS005"]
["A-11","固体粘弾性測定装置 LOF・9932-001"]
["A-13","走査型プローブ顕微鏡 SPM-9600"]
["A-14","高速液体クロマトグラフ質量分析計 LCMS-2020"]
["A-15","電子線トモグラフィ装置"]
["A-16","QuantStudio12KFlex リアルタイムPCRシステム"]
["A-17","微量天然化合物高速液体クロマトグラフ質量分析装置システム LCMS-8030"]
["A-18","高速液体クロマトグラフ質量分析計システム LCMS-8040"]
["A-19","水晶振動子マイクロバランス応用・分子間相互作用解析システム"]
["A-20","共焦点レーザ走査型顕微鏡 FV1200"]
["A-22","FT／IR－6600 フーリエ変換赤外分光光度計（type VFM）"]
["A-23","ACQUITY UPLC PDA／Xevo Qtof MS KN システム "]
["A-24","超臨界流体リモートシステム"]
["A-25","高分解能質量分析計システム"]
["A-26","CFX Connect リアルタイムPCR 解析システム"]
["A-27","高圧凍結装置 EM HPM100"]
["A-28","CPAD搭載高輝度単結晶X線構造解析装置"]
["A-29","レーザーラマン顕微鏡 RAMANtouch"]
["A-30","クライオ走査電子顕微鏡 SU8230/Alto2500/Cryoplunge3"]
["A-32","Vector network analyzer P5008B"]
["S-1","クリーンルーム"]
["S-2","高磁場高周波核磁気共鳴装置 JEOL ECA600"]
["S-21","SQUID磁束計1（磁化率測定装置MPMS 1テスラ）"]
["S-22","SQUID磁束計2（磁化率測定装置MPMS 5テスラ）"]
["S-23","SQUID磁束計3（磁化率測定装置MPMS 5.5テスラ）"]
["S-24","SQUID磁束計4（磁化率測定装置MPMS 7テスラ）"]
["A-12","超伝導マグネット AVANCEⅢ400NルーチンNMR特別仕様"]
["A-31","AVANCEⅢ500型 デジタルNMR装置"]
["B-1","生命科学組換え体育成温室"]
["B-3","高感度MALDI-TOF MS autoflexIII-SKL TOF MSシステム"]

{"sheet":"Sheet1","index":6,"n_rows":63,"n_cols":11,"rows_kept":63,"cut":false,"hidden":true,"merged":[]}
[null,null,null,"第３条第１号に掲げる者","第３条第２号に掲げる者","第３条第３号に掲げる者"]
["設備番号","対象・対象外","単位","学内","学術機関","民間機関",null,"S-17","学内",{"$f":"H2&I2","v":"S-17学内"},510]
["S-1","※対象外",null,null,null,null,null,"S-17","学術機関",{"$f":"H3&I3","v":"S-17学術機関"},"－"]
["S-2","※対象外",null,null,null,null,null,"S-17","民間機関","S-17民間機関","－"]
["S-3","※対象外",null,null,null,null,null,"S-18","学内",{"$f":"H5&I5","v":"S-18学内"},910]
["S-4","※対象外",null,null,null,null,null,"S-18","学術機関","S-18学術機関",1790]
["S-5","※対象外",null,null,null,null,null,"S-18","民間機関","S-18民間機関",5900]
["S-6","※対象外",null,null,null,null,null,"S-27","学内","S-27学内",10160]
["S-7","※対象外",null,null,null,null,null,"S-27","学術機関","S-27学術機関",14040]
["S-8","※対象外",null,null,null,null,null,"S-27","民間機関","S-27民間機関",63900]
["S-9","※対象外",null,null,null,null,null,"A-7","学内",{"$f":"H11&I11","v":"A-7学内"},2670]
["S-10","※対象外",null,null,null,null,null,"A-7","学術機関","A-7学術機関",5870]
["S-11","※対象外",null,null,null,null,null,"A-7","民間機関","A-7民間機関",11700]
["S-12","※対象外",null,null,null,null,null,"A-14","学内","A-14学内",2100]
["S-13","※対象外",null,null,null,null,null,"A-14","学術機関","A-14学術機関",7800]
["S-14","※対象外",null,null,null,null,null,"A-14","民間機関","A-14民間機関",10800]
["S-15","※対象外",null,null,null,null,null,"A-15","学内","A-15学内",1940]
["S-16","※対象外",null,null,null,null,null,"A-15","学術機関","A-15学術機関",17670]
["S-17","！事前講習対象機器！",{"$f":"'別表１、３'!E19","v":"1回当たり\n(事前講習)"},510,"ー","ー",null,"A-15","民間機関","A-15民間機関",30200]
["S-18","！事前講習対象機器！",{"$f":"'別表１、３'!E21","v":"1回当たり\n(事前講習)"},910,1790,5900]
["S-19","※対象外"]
["S-20","※対象外"]
["S-21","※対象外"]
["S-22","※対象外"]
["S-23","※対象外"]
["S-24","※対象外"]
["S-25","※対象外"]
["S-26","※対象外"]
["S-27","！事前講習対象機器！",{"$f":"'別表１、３'!E31","v":"1回当たり\n(事前講習)"},10160,14040,63900]
["S-28","※対象外"]
["S-29","※対象外"]
["S-30","※対象外"]
["A-1","※対象外"]
["A-2","※対象外"]
["A-3","※対象外"]
["A-4","※対象外"]
["A-5","※対象外"]
["A-6","※対象外"]
["A-7","！事前講習対象機器！",{"$f":"'別表１、３'!E42","v":"1回当たり\n(事前講習)"},2670,5870,11700]
["A-8","※対象外"]
["A-9","※対象外"]
["A-10","※対象外"]
["A-11","※対象外"]
["A-12","※対象外"]
["A-13","※対象外"]
["A-14","！事前講習対象機器！",{"$f":"'別表１、３'!E51","v":"1回当たり\n(事前講習)"},2100,7800,10800]
["A-15","！事前講習対象機器！",{"$f":"'別表１、３'!E54","v":"1回当たり\n(事前講習)"},1940,17670,30200]
["A-16","※対象外"]
["A-17","※対象外"]
["A-18","※対象外"]
["A-19","※対象外"]
["A-20","※対象外"]
["A-22","※対象外"]
["A-23","※対象外"]
["A-24","※対象外"]
["A-25","※対象外"]
["A-26","※対象外"]
["A-27","※対象外"]
["A-28","※対象外"]
["A-29","※対象外"]
{"$rows_left_out":4}
{"sheet":"★R6以降追加・変更したもの(R7.7.1追記）","index":7,"n_rows":17,"n_cols":13,"rows_kept":17,"cut":false,"hidden":true,"merged":[]}
["①","別表１について、Ｓ-3からS-7の分析委託について削除し、「（様式２）測定・分析等委託申請書・承認書」様式へ移動。"]
["②","共同利用申請書の「設備番号」のプルダウンリストについては、これまでは全ての設備番号が選択できたが、"]
[null,"北部拠点の基本フローを用いない設備については、選択範囲から除外する。"]
["③","生命科学研究科【B】の設備について「共同利用申請書」の利用設備欄で選択可能としていたが、R5.7.1に生命の委託が追加された際に、"]
[null,"選択欄から対象外としている。（利用申請書と委託申請書で取扱いが異なっていた）今回、選択欄から対象外とし統一を図る。"]
["④","共同利用申請書「利用期間」の時間数の欄については、自動計算を取りやめ、手入力方式へ変更。"]
[null,"※元の数式【=CEILING(M15-F15,\"1:00\")】　終了時間　－　開始時間　としていたが、日付を超える利用の際、正しく反映しないため"]
[null,"今回、手入力へ変更。（日を跨いでの利用申請実績が多くなってきているため）"]
["⑤","共同利用申請書で、【事前講習あり】の設備等番号を選択すると「共同利用申請書」の「事前講習料」欄が青色表示。",null,null,null,null,null,null,null,null,null,null,"S-17、S-18、A-7、A-14、A-15"]
["⑥","共同利用申請書にて【事前講習あり】の設備等番号を選択すると「使用簿（管理責任者用）シート、管理表転記用シート」の「事項名」欄が橙色表示。"]
["⑦","管理表転記用の予算区分で「経費名称」の選択により、「請求処理方法」を自動表示設定。"]
["⑧","管理表転記用の予算区分で選択項目を申請書と統一する。（機能強化経費の記載等の修正）"]
["⑨","入力不要（数式あり）欄を灰色表示。拠点による要入力コメント塗りつぶしを変更。"]
["⑩　","S-27に関する情報を追加（R6.10.01追加）"]
["⑪","S-28、S-29、S-30、A-32に関する情報を追記（R7.04.01追加）"]
["⑫","A-17価格改定（R7.04.01より）"]
["⑬　","B-3に関する情報を追記（R7.07.01追加）"]